{"text_format":"1","workbook":"xlsx","n_sheets":6,"sheets":["Sheet1","Data validation","ELEM list","Assessment form","Dashboard","Data summary"],"not_rendered":{"charts":3,"images":2,"macros":1,"external_links":0,"defined_names":12,"comments":0,"pivot_tables":0},"unopened":[],"bounds":{"document_bytes":16777216,"sheet_cells":100000,"rows_first":2000,"rows_last":500,"rows_between":2000,"halvings":0,"cell_chars":16384,"cell_head_chars":4096},"cells_cut":0,"cells_raw":0,"read":"whole","date_system":"1900"}

{"sheet":"Sheet1","index":0,"n_rows":86,"n_cols":7,"rows_kept":86,"cut":false,"hidden":true,"merged":[]}
[null,null,"Interagency Emergency Health Kit 2017- Modules and Items\nSeptember 2017"]
[]
["Module","Pharmacological class","Item description","UOM","Qty","ATC"]
["basic module","Anti-infective medicines","Albendazole, chewable tablets 400 mg","tablet",2000,"P02CA03"]
["basic module","Anti-infective medicines","Amoxicillin, dispersible tablets 250 mg","tablet",30000,"J01CA04"]
["basic module","Dermatological medicines","Benzyl benzoate, lotion 25%[1] ","bottle, 1 litre",10,"P03AX01"]
["basic module","Disinfectants and antiseptics","Chlorhexidine digluconate, solution 5%","bottle, 1 litre",10,"A01AB03"]
["basic module","Medicines affecting the blood ","Ferrous sulfate + folic acid, tablets 200 mg+0.4 mg (and anolgues)","tablet",20000,"B03AE"]
["basic module","Analgesics","Ibuprofen, tablets 200 mg","tablet",40000,"M01AE01"]
["basic module","Dermatological medicines","Miconazole, cream 2%","tube 30 g",200,"D01AC02"]
["basic module","Gastrointestinal medicines","Omeprazole, solid oral dosage form 20 mg","tablet/capsule",1000,"A02BC02"]
["basic module","Solutions correcting water, electrolytes and acid-based disturbances ","ORS (oral rehydration salt) powder for dilution","sachet for 1 litre",2000,"A07CA"]
["basic module","Analgesics","Paracetamol, dispersible tablets 100 mg[2] ","tablet",10000,"N02BE01","mettere gocce"]
["basic module","Analgesics","Paracetamol, tablets, 500 mg","tablet",20000,"N02BE01"]
["basic module","Disinfectants and antiseptics","Povidone iodine, solution 10% ","bottle, 200 ml ",120,"D08AG02"]
["basic module","Anti-infective medicines","Gentamicine, eye drops 0,3%","bottle 10 ml",500,"S01AA11"]
["Module cold chain","Hormones , other endocrine medicines","Human Insulin NPH 100 IU/ml, 10 ml EP","vial",60,"A10AC01"]
["Module cold chain","Hormones , other endocrine medicines","Human Insulin Mix 70/30 100IU/ml, 10 ml EP","vial",200,"A10AD01"]
["Module cold chain","Hormones , other endocrine medicines","Human Insulin R100 IU/ml, 10 ml EP","vial",60,"A10Ab01"]
["Module cold chain","Hormones , other endocrine medicines","Glucagon1 mg/ mL.","vial",20,"H04AA01"]
["Supplementary Module","Anaesthetics","Ketamine, injection 50 mg/ml","10 ml/vial",25,"N01AX03"]
["Supplementary Module","Anaesthetics","Lidocaine, injection 1% ","20 ml/vial",50,"N01BB02"]
["Supplementary Module","Analgesics","Morphine, injection 10mg/ml","1 ml/ampoule",50,"N02AA01"]
["Supplementary Module","Analgesics","Morphine, tablet 10 mg ","tablet ",200,"N02AA01"]
["Supplementary Module","Antiallergics","Hydrocortisone, powder for injection 100mg  (as sodium succinate) ","vial",50,"H02AB09"]
["Supplementary Module","Antidotes","Calcium gluconate, injection 100mg/ml","10 ml/ampoule",10,"A12AA03"]
["Supplementary Module","Antidotes","Naloxone, injection 0.4 mg/ml","1 ml/ampoule",10,"V03AB15"]
["Supplementary Module","Anticonvulsants/antiepileptics","Carbamazepine tablets 200mg","tablet ",1605,"N03AF01"]
["Supplementary Module","Anticonvulsants/antiepileptics","Diazepam, injection 5mg/ml","2 ml/ampoule",200,"N05BA01"]
["Supplementary Module","Anticonvulsants/antiepileptics","Sodium Valproate 500mg enteric coated tablets","tablet",1900,"N03AG01"]
{"$rows_left_out":57}
{"sheet":"Data validation","index":1,"n_rows":14,"n_cols":3,"rows_kept":14,"cut":false,"hidden":true,"merged":[]}
["Nystatin, oral liquid 100,000IU/ml (30ml)","bottle 30ml",50]
["Nystatin, oral liquid 100,000IU/ml (100ml)","bottle 100ml",15]
[]
["Paracetamol, solution 100mg/ml (30ml)  [3]","bottle 30ml",334]
["Paracetamol, suspension 120mg/5ml (120ml) [3]","bottle 120ml",348]
[]
["Carbamazepine tablets 200mg [1]","tablets",1605]
["Phenobarbital tablets 50 mg [1]","tablets",1605]
[]
["Ascorbic acid, tablets 500mg ","tablet",2000]
["Ascorbic acid, injectable solution 500mg/5ml","vial",2000]
[]
["Amoxicillin, dispersible tablets 500 mg [1]","tablet",15000]
["amoxicillin suspension 250mg/5mL (100ml) [1]","bottle 100ml",{"$f":"C13*(0.5/5)","v":1500}]

{"sheet":"ELEM list","index":2,"n_rows":123,"n_cols":5,"rows_kept":123,"cut":false,"hidden":false,"merged":[]}
[]
[]
[]
[]
[]
[]
[null,"Basic Module"]
["#","Item description","UOM","Qty","ATC"]
[1,"Albendazole, chewable tablets 400 mg","tablet",2000,"P02CA03"]
[2,"Amoxicillin, dispersible tablets 500 mg [1]","tablet",15000,"J01CA04"]
[3,"Benzyl benzoate, lotion 25% [2] ","bottle, 1 litre",10,"P03AX01"]
[4,"Chlorhexidine digluconate, solution 5%","bottle, 1 litre",10,"A01AB03"]
[5,"Ferrous sulfate + folic acid, tablets 200 mg+0.4 mg (and analgues)","tablet",20000,"B03AE"]
[6,"Ibuprofen, tablets 200 mg","tablet",40000,"M01AE01"]
[7,"Miconazole, cream 2%","tube 30 g",200,"D01AC02"]
[8,"Omeprazole, solid oral dosage form 20 mg","tablet/capsule",1000,"A02BC02"]
[9,"ORS (oral rehydration salt) powder for dilution","sachet for 1 litre",2000,"A07CA"]
[10,"Paracetamol, solution 100mg/ml (30ml) [3]","bottle",334,"N02BE01"]
[11,"Paracetamol, tablets, 500 mg","tablet",20000,"N02BE01"]
[12,"Povidone iodine, solution 10% ","bottle, 200 ml ",120,"D08AG02"]
[13,"Gentamicine, eye drops 0,3%","bottle 10 ml",500,"S01AA11"]
[]
[]
[]
[null," Cold chain  module"]
["#","Item description","UOM","Qty","ATC"]
[null,"Hormones , other endocrine medicines"]
[1,"Human Insulin NPH 100 IU/ml, 10 ml","vial",60,"A10AC01"]
[2,"Human Insulin Mix 70/30 100IU/ml, 10 ml","vial",200,"A10AD01"]
[3,"Human Insulin R100 IU/ml, 10 ml","vial",60,"A10Ab01"]
{"$rows_left_out":94}
{"sheet":"Assessment form","index":3,"n_rows":89,"n_cols":9,"rows_kept":89,"cut":false,"hidden":false,"merged":[[2,3,4,3],[2,4,4,4],[2,6,4,6]]}
[]
[null,null,null,"Comment","Disaster Index",null,"N° patients considered "]
[null,null,null,{"$f":"IF(E3=0,\"\",IF(AND(E3>0,E3<0.33),\"Low coverage\",IF(AND(E3>=0.33,E3<0.66),\"Medium coverage\",IF(AND(E3>=0.66,E3<1),\"High coverage\",IF(E3=1,\"Full coverage\",\"\")))))","v":""},{"$f":"IFERROR(SUM(I8:I996)/COUNTA(I8:I996),\"\")","v":0}]
[]
[]
[]
["Module","ATC","Pharmacological class","Items description","UOM","Qty std 10.K patients","Qty for patients considered","Qty in stock","% covered"]
["basic module",{"$f":"INDEX('ELEM list'!E:E,MATCH('Assessment form'!D8,'ELEM list'!B:B,0))","v":"P02CA03"},"Anti-infective medicines",{"$f":"'ELEM list'!B9","v":"Albendazole, chewable tablets 400 mg"},{"$f":"'ELEM list'!C9","v":"tablet"},{"$f":"'ELEM list'!D9","v":2000},{"$f":"IFERROR(IF($G$3=0,\"\",IF(ROUND((F8*$G$3)/10000,0)<1,1,ROUND((F8*$G$3)/10000,0))),\"ERROR\")","v":""},null,{"$f":"IFERROR(IF($G:$G=\"ERROR\",\"ERROR\",IF(($H:$H/$G:$G)<=1,$H:$H/$G:$G,1)),\"\")","v":""}]
["basic module","J01CA04","Anti-infective medicines","amoxicillin suspension 250mg/5mL (100ml) [1]",{"$f":"IFERROR(INDEX('Data validation'!$B$13:$B$14,MATCH('Assessment form'!$D$9,'Data validation'!$A$13:$A$14,0)),\"ERROR\")","v":"bottle 100ml"},{"$f":"IFERROR(INDEX('Data validation'!$C$13:$C$14,MATCH('Assessment form'!$D$9,'Data validation'!$A$13:$A$14,0)),\"ERROR\")","v":1500},"",null,{"$f":"IFERROR(IF($G:$G=\"ERROR\",\"ERROR\",IF(($H:$H/$G:$G)<=1,$H:$H/$G:$G,1)),\"\")","v":""}]
["basic module",{"$f":"INDEX('ELEM list'!E:E,MATCH('Assessment form'!D10,'ELEM list'!B:B,0))","v":"P03AX01"},"Dermatological medicines",{"$f":"'ELEM list'!B11","v":"Benzyl benzoate, lotion 25% [2] "},{"$f":"'ELEM list'!C11","v":"bottle, 1 litre"},{"$f":"'ELEM list'!D11","v":10},"",null,""]
["basic module",{"$f":"INDEX('ELEM list'!E:E,MATCH('Assessment form'!D11,'ELEM list'!B:B,0))","v":"A01AB03"},"Disinfectants and antiseptics",{"$f":"'ELEM list'!B12","v":"Chlorhexidine digluconate, solution 5%"},{"$f":"'ELEM list'!C12","v":"bottle, 1 litre"},{"$f":"'ELEM list'!D12","v":10},"",null,""]
["basic module",{"$f":"INDEX('ELEM list'!E:E,MATCH('Assessment form'!D12,'ELEM list'!B:B,0))","v":"B03AE"},"Medicines affecting the blood ",{"$f":"'ELEM list'!B13","v":"Ferrous sulfate + folic acid, tablets 200 mg+0.4 mg (and analgues)"},{"$f":"'ELEM list'!C13","v":"tablet"},{"$f":"'ELEM list'!D13","v":20000},"",null,""]
["basic module",{"$f":"INDEX('ELEM list'!E:E,MATCH('Assessment form'!D13,'ELEM list'!B:B,0))","v":"M01AE01"},"Analgesics",{"$f":"'ELEM list'!B14","v":"Ibuprofen, tablets 200 mg"},{"$f":"'ELEM list'!C14","v":"tablet"},{"$f":"'ELEM list'!D14","v":40000},"",null,""]
["basic module",{"$f":"INDEX('ELEM list'!E:E,MATCH('Assessment form'!D14,'ELEM list'!B:B,0))","v":"D01AC02"},"Dermatological medicines",{"$f":"'ELEM list'!B15","v":"Miconazole, cream 2%"},{"$f":"'ELEM list'!C15","v":"tube 30 g"},{"$f":"'ELEM list'!D15","v":200},"",null,""]
["basic module",{"$f":"INDEX('ELEM list'!E:E,MATCH('Assessment form'!D15,'ELEM list'!B:B,0))","v":"A02BC02"},"Gastrointestinal medicines",{"$f":"'ELEM list'!B16","v":"Omeprazole, solid oral dosage form 20 mg"},{"$f":"'ELEM list'!C16","v":"tablet/capsule"},{"$f":"'ELEM list'!D16","v":1000},"",null,""]
["basic module",{"$f":"INDEX('ELEM list'!E:E,MATCH('Assessment form'!D16,'ELEM list'!B:B,0))","v":"A07CA"},"Solutions correcting water, electrolytes and acid-based disturbances",{"$f":"'ELEM list'!B17","v":"ORS (oral rehydration salt) powder for dilution"},{"$f":"'ELEM list'!C17","v":"sachet for 1 litre"},{"$f":"'ELEM list'!D17","v":2000},"",null,""]
["basic module","N02BE01","Analgesics","Paracetamol, solution 100mg/ml (30ml)  [3]",{"$f":"IFERROR(INDEX('Data validation'!$B$4:$B$5,MATCH('Assessment form'!$D$17,'Data validation'!$A$4:$A$5,0)),\"ERROR\")","v":"bottle 30ml"},{"$f":"IFERROR(INDEX('Data validation'!$C$4:$C$5,MATCH('Assessment form'!$D$17,'Data validation'!$A$4:$A$5,0)),\"ERROR\")","v":334},"",null,""]
["basic module",{"$f":"INDEX('ELEM list'!E:E,MATCH('Assessment form'!D18,'ELEM list'!B:B,0))","v":"N02BE01"},"Analgesics",{"$f":"'ELEM list'!B19","v":"Paracetamol, tablets, 500 mg"},{"$f":"'ELEM list'!C19","v":"tablet"},{"$f":"'ELEM list'!D19","v":20000},"",null,""]
["basic module",{"$f":"INDEX('ELEM list'!E:E,MATCH('Assessment form'!D19,'ELEM list'!B:B,0))","v":"D08AG02"},"Disinfectants and antiseptics",{"$f":"'ELEM list'!B20","v":"Povidone iodine, solution 10% "},{"$f":"'ELEM list'!C20","v":"bottle, 200 ml "},{"$f":"'ELEM list'!D20","v":120},"",null,""]
["basic module",{"$f":"INDEX('ELEM list'!E:E,MATCH('Assessment form'!D20,'ELEM list'!B:B,0))","v":"S01AA11"},"Anti-infective medicines",{"$f":"'ELEM list'!B21","v":"Gentamicine, eye drops 0,3%"},{"$f":"'ELEM list'!C21","v":"bottle 10 ml"},{"$f":"'ELEM list'!D21","v":500},"",null,""]
["Module cold chain",{"$f":"INDEX('ELEM list'!E:E,MATCH('Assessment form'!D21,'ELEM list'!B:B,0))","v":"A10AC01"},"Hormones , other endocrine medicines",{"$f":"'ELEM list'!B28","v":"Human Insulin NPH 100 IU/ml, 10 ml"},{"$f":"'ELEM list'!C28","v":"vial"},{"$f":"'ELEM list'!D28","v":60},"",null,""]
["Module cold chain",{"$f":"INDEX('ELEM list'!E:E,MATCH('Assessment form'!D22,'ELEM list'!B:B,0))","v":"A10AD01"},"Hormones , other endocrine medicines",{"$f":"'ELEM list'!B29","v":"Human Insulin Mix 70/30 100IU/ml, 10 ml"},{"$f":"'ELEM list'!C29","v":"vial"},{"$f":"'ELEM list'!D29","v":200},"",null,""]
["Module cold chain",{"$f":"INDEX('ELEM list'!E:E,MATCH('Assessment form'!D23,'ELEM list'!B:B,0))","v":"A10Ab01"},"Hormones , other endocrine medicines",{"$f":"'ELEM list'!B30","v":"Human Insulin R100 IU/ml, 10 ml"},{"$f":"'ELEM list'!C30","v":"vial"},{"$f":"'ELEM list'!D30","v":60},"",null,""]
["Module cold chain",{"$f":"INDEX('ELEM list'!E:E,MATCH('Assessment form'!D24,'ELEM list'!B:B,0))","v":"H04AA01"},"Hormones , other endocrine medicines",{"$f":"'ELEM list'!B31","v":"Glucagon1 mg/ mL."},{"$f":"'ELEM list'!C31","v":"vial"},{"$f":"'ELEM list'!D31","v":20},"",null,""]
["Supplementary Module",{"$f":"INDEX('ELEM list'!E:E,MATCH('Assessment form'!D25,'ELEM list'!B:B,0))","v":"N01AX03"},"Anaesthetics",{"$f":"'ELEM list'!B38","v":"Ketamine, injection 50 mg/ml"},{"$f":"'ELEM list'!C38","v":"10 ml/vial"},{"$f":"'ELEM list'!D38","v":25},"",null,""]
["Supplementary Module",{"$f":"INDEX('ELEM list'!E:E,MATCH('Assessment form'!D26,'ELEM list'!B:B,0))","v":"N01BB02"},"Anaesthetics",{"$f":"'ELEM list'!B39","v":"Lidocaine, injection 1% "},{"$f":"'ELEM list'!C39","v":"20 ml/vial"},{"$f":"'ELEM list'!D39","v":50},"",null,""]
["Supplementary Module",{"$f":"INDEX('ELEM list'!E:E,MATCH('Assessment form'!D27,'ELEM list'!B:B,0))","v":"N02AA01"},"Analgesics",{"$f":"'ELEM list'!B41","v":"Morphine, injection 10mg/ml"},{"$f":"'ELEM list'!C41","v":"1 ml/ampoule"},{"$f":"'ELEM list'!D41","v":50},"",null,""]
["Supplementary Module",{"$f":"INDEX('ELEM list'!E:E,MATCH('Assessment form'!D28,'ELEM list'!B:B,0))","v":"N02AA01"},"Analgesics",{"$f":"'ELEM list'!B42","v":"Morphine, tablets 10 mg (immediate release)"},{"$f":"'ELEM list'!C42","v":"tablet "},{"$f":"'ELEM list'!D42","v":200},"",null,""]
["Supplementary Module",{"$f":"INDEX('ELEM list'!E:E,MATCH('Assessment form'!D29,'ELEM list'!B:B,0))","v":"H02AB09"},"Antiallergics",{"$f":"'ELEM list'!B44","v":"Hydrocortisone, powder for injection 100mg/ml  (as sodium succinate) "},{"$f":"'ELEM list'!C44","v":"vial"},{"$f":"'ELEM list'!D44","v":50},"",null,""]
["Supplementary Module",{"$f":"INDEX('ELEM list'!E:E,MATCH('Assessment form'!D30,'ELEM list'!B:B,0))","v":"A12AA03"},"Antidotes",{"$f":"'ELEM list'!B46","v":"Calcium gluconate, injection 100mg/ml"},{"$f":"'ELEM list'!C46","v":"10 ml/ampoule"},{"$f":"'ELEM list'!D46","v":10},"",null,""]
{"$rows_left_out":60}
{"sheet":"Dashboard","index":4,"n_rows":0,"n_cols":0,"rows_kept":0,"cut":false,"hidden":false,"merged":[]}

{"sheet":"Data summary","index":5,"n_rows":36,"n_cols":6,"rows_kept":36,"cut":false,"hidden":false,"merged":[[8,1,8,4],[1,1,1,2]]}
[]
[null,"Modules covered"]
[null,"Modules","% avg coverage",null,"N° patients covered","Disaster Index"]
[null,"basic module",{"$f":"IFERROR(AVERAGEIF('Assessment form'!$A$8:$A$88,$B4,'Assessment form'!$I$8:$I$88),\"\")","v":""},null,{"$f":"'Assessment form'!G3","v":0},{"$f":"'Assessment form'!E3","v":0}]
[null,"Module cold chain",{"$f":"IFERROR(AVERAGEIF('Assessment form'!$A$8:$A$88,$B5,'Assessment form'!$I$8:$I$88),\"\")","v":""}]
[null,"Supplementary Module",{"$f":"IFERROR(AVERAGEIF('Assessment form'!$A$8:$A$88,$B6,'Assessment form'!$I$8:$I$88),\"\")","v":""}]
[null,"Supplementary Module – PEP",{"$f":"IFERROR(AVERAGEIF('Assessment form'!$A$8:$A$88,$B7,'Assessment form'!$I$8:$I$88),\"\")","v":""}]
[]
[null,"N° and qty of items covered for each pharmacological class"]
[null,"Pharmacological class","N°","% of items covered","% of QTY covered"]
[null,"Anti-infective medicines",{"$f":"COUNTIFS('Assessment form'!$C$8:$C$88,'Data summary'!$B11,'Assessment form'!$I$8:$I$88,\">0\")","v":0},{"$f":"COUNTIFS('Assessment form'!$C$8:$C$88,'Data summary'!$B11,'Assessment form'!$I$8:$I$88,\">0\")/COUNTIF('Assessment form'!$C$8:$C$88,'Data summary'!$B11)","v":0},{"$f":"IFERROR(AVERAGEIF('Assessment form'!$C$8:$C$89,'Data summary'!$B11,'Assessment form'!$I$8:$I$89),\"\")","v":""}]
[null,"Dermatological medicines",{"$f":"COUNTIFS('Assessment form'!$C$8:$C$88,'Data summary'!$B12,'Assessment form'!$I$8:$I$88,\">0\")","v":0},{"$f":"COUNTIFS('Assessment form'!$C$8:$C$88,'Data summary'!$B12,'Assessment form'!$I$8:$I$88,\">0\")/COUNTIF('Assessment form'!$C$8:$C$88,'Data summary'!$B12)","v":0},{"$f":"IFERROR(AVERAGEIF('Assessment form'!$C$8:$C$89,'Data summary'!$B12,'Assessment form'!$I$8:$I$89),\"\")","v":""}]
[null,"Disinfectants and antiseptics",{"$f":"COUNTIFS('Assessment form'!$C$8:$C$88,'Data summary'!$B13,'Assessment form'!$I$8:$I$88,\">0\")","v":0},{"$f":"COUNTIFS('Assessment form'!$C$8:$C$88,'Data summary'!$B13,'Assessment form'!$I$8:$I$88,\">0\")/COUNTIF('Assessment form'!$C$8:$C$88,'Data summary'!$B13)","v":0},{"$f":"IFERROR(AVERAGEIF('Assessment form'!$C$8:$C$89,'Data summary'!$B13,'Assessment form'!$I$8:$I$89),\"\")","v":""}]
[null,"Medicines affecting the blood ",{"$f":"COUNTIFS('Assessment form'!$C$8:$C$88,'Data summary'!$B14,'Assessment form'!$I$8:$I$88,\">0\")","v":0},{"$f":"COUNTIFS('Assessment form'!$C$8:$C$88,'Data summary'!$B14,'Assessment form'!$I$8:$I$88,\">0\")/COUNTIF('Assessment form'!$C$8:$C$88,'Data summary'!$B14)","v":0},{"$f":"IFERROR(AVERAGEIF('Assessment form'!$C$8:$C$89,'Data summary'!$B14,'Assessment form'!$I$8:$I$89),\"\")","v":""}]
[null,"Analgesics",{"$f":"COUNTIFS('Assessment form'!$C$8:$C$88,'Data summary'!$B15,'Assessment form'!$I$8:$I$88,\">0\")","v":0},{"$f":"COUNTIFS('Assessment form'!$C$8:$C$88,'Data summary'!$B15,'Assessment form'!$I$8:$I$88,\">0\")/COUNTIF('Assessment form'!$C$8:$C$88,'Data summary'!$B15)","v":0},{"$f":"IFERROR(AVERAGEIF('Assessment form'!$C$8:$C$89,'Data summary'!$B15,'Assessment form'!$I$8:$I$89),\"\")","v":""}]
[null,"Gastrointestinal medicines",{"$f":"COUNTIFS('Assessment form'!$C$8:$C$88,'Data summary'!$B16,'Assessment form'!$I$8:$I$88,\">0\")","v":0},{"$f":"COUNTIFS('Assessment form'!$C$8:$C$88,'Data summary'!$B16,'Assessment form'!$I$8:$I$88,\">0\")/COUNTIF('Assessment form'!$C$8:$C$88,'Data summary'!$B16)","v":0},{"$f":"IFERROR(AVERAGEIF('Assessment form'!$C$8:$C$89,'Data summary'!$B16,'Assessment form'!$I$8:$I$89),\"\")","v":""}]
[null,"Hormones , other endocrine medicines",{"$f":"COUNTIFS('Assessment form'!$C$8:$C$88,'Data summary'!$B17,'Assessment form'!$I$8:$I$88,\">0\")","v":0},{"$f":"COUNTIFS('Assessment form'!$C$8:$C$88,'Data summary'!$B17,'Assessment form'!$I$8:$I$88,\">0\")/COUNTIF('Assessment form'!$C$8:$C$88,'Data summary'!$B17)","v":0},{"$f":"IFERROR(AVERAGEIF('Assessment form'!$C$8:$C$89,'Data summary'!$B17,'Assessment form'!$I$8:$I$89),\"\")","v":""}]
[null,"Anaesthetics",{"$f":"COUNTIFS('Assessment form'!$C$8:$C$88,'Data summary'!$B18,'Assessment form'!$I$8:$I$88,\">0\")","v":0},{"$f":"COUNTIFS('Assessment form'!$C$8:$C$88,'Data summary'!$B18,'Assessment form'!$I$8:$I$88,\">0\")/COUNTIF('Assessment form'!$C$8:$C$88,'Data summary'!$B18)","v":0},{"$f":"IFERROR(AVERAGEIF('Assessment form'!$C$8:$C$89,'Data summary'!$B18,'Assessment form'!$I$8:$I$89),\"\")","v":""}]
[null,"Antiallergics",{"$f":"COUNTIFS('Assessment form'!$C$8:$C$88,'Data summary'!$B19,'Assessment form'!$I$8:$I$88,\">0\")","v":0},{"$f":"COUNTIFS('Assessment form'!$C$8:$C$88,'Data summary'!$B19,'Assessment form'!$I$8:$I$88,\">0\")/COUNTIF('Assessment form'!$C$8:$C$88,'Data summary'!$B19)","v":0},{"$f":"IFERROR(AVERAGEIF('Assessment form'!$C$8:$C$89,'Data summary'!$B19,'Assessment form'!$I$8:$I$89),\"\")","v":""}]
[null,"Antidotes",{"$f":"COUNTIFS('Assessment form'!$C$8:$C$88,'Data summary'!$B20,'Assessment form'!$I$8:$I$88,\">0\")","v":0},{"$f":"COUNTIFS('Assessment form'!$C$8:$C$88,'Data summary'!$B20,'Assessment form'!$I$8:$I$88,\">0\")/COUNTIF('Assessment form'!$C$8:$C$88,'Data summary'!$B20)","v":0},{"$f":"IFERROR(AVERAGEIF('Assessment form'!$C$8:$C$89,'Data summary'!$B20,'Assessment form'!$I$8:$I$89),\"\")","v":""}]
[null,"Anticonvulsants/antiepileptics",{"$f":"COUNTIFS('Assessment form'!$C$8:$C$88,'Data summary'!$B21,'Assessment form'!$I$8:$I$88,\">0\")","v":0},{"$f":"COUNTIFS('Assessment form'!$C$8:$C$88,'Data summary'!$B21,'Assessment form'!$I$8:$I$88,\">0\")/COUNTIF('Assessment form'!$C$8:$C$88,'Data summary'!$B21)","v":0},{"$f":"IFERROR(AVERAGEIF('Assessment form'!$C$8:$C$89,'Data summary'!$B21,'Assessment form'!$I$8:$I$89),\"\")","v":""}]
[null,"Cardiovascular medicines",{"$f":"COUNTIFS('Assessment form'!$C$8:$C$88,'Data summary'!$B22,'Assessment form'!$I$8:$I$88,\">0\")","v":0},{"$f":"COUNTIFS('Assessment form'!$C$8:$C$88,'Data summary'!$B22,'Assessment form'!$I$8:$I$88,\">0\")/COUNTIF('Assessment form'!$C$8:$C$88,'Data summary'!$B22)","v":0},{"$f":"IFERROR(AVERAGEIF('Assessment form'!$C$8:$C$89,'Data summary'!$B22,'Assessment form'!$I$8:$I$89),\"\")","v":""}]
[null,"Diuretics",{"$f":"COUNTIFS('Assessment form'!$C$8:$C$88,'Data summary'!$B23,'Assessment form'!$I$8:$I$88,\">0\")","v":0},{"$f":"COUNTIFS('Assessment form'!$C$8:$C$88,'Data summary'!$B23,'Assessment form'!$I$8:$I$88,\">0\")/COUNTIF('Assessment form'!$C$8:$C$88,'Data summary'!$B23)","v":0},{"$f":"IFERROR(AVERAGEIF('Assessment form'!$C$8:$C$89,'Data summary'!$B23,'Assessment form'!$I$8:$I$89),\"\")","v":""}]
[null,"Oxytocics",{"$f":"COUNTIFS('Assessment form'!$C$8:$C$88,'Data summary'!$B24,'Assessment form'!$I$8:$I$88,\">0\")","v":0},{"$f":"COUNTIFS('Assessment form'!$C$8:$C$88,'Data summary'!$B24,'Assessment form'!$I$8:$I$88,\">0\")/COUNTIF('Assessment form'!$C$8:$C$88,'Data summary'!$B24)","v":0},{"$f":"IFERROR(AVERAGEIF('Assessment form'!$C$8:$C$89,'Data summary'!$B24,'Assessment form'!$I$8:$I$89),\"\")","v":""}]
[null,"Mental health medicines",{"$f":"COUNTIFS('Assessment form'!$C$8:$C$88,'Data summary'!$B25,'Assessment form'!$I$8:$I$88,\">0\")","v":0},{"$f":"COUNTIFS('Assessment form'!$C$8:$C$88,'Data summary'!$B25,'Assessment form'!$I$8:$I$88,\">0\")/COUNTIF('Assessment form'!$C$8:$C$88,'Data summary'!$B25)","v":0},{"$f":"IFERROR(AVERAGEIF('Assessment form'!$C$8:$C$89,'Data summary'!$B25,'Assessment form'!$I$8:$I$89),\"\")","v":""}]
[null,"Medicines acting on the respiratory tract",{"$f":"COUNTIFS('Assessment form'!$C$8:$C$88,'Data summary'!$B26,'Assessment form'!$I$8:$I$88,\">0\")","v":0},{"$f":"COUNTIFS('Assessment form'!$C$8:$C$88,'Data summary'!$B26,'Assessment form'!$I$8:$I$88,\">0\")/COUNTIF('Assessment form'!$C$8:$C$88,'Data summary'!$B26)","v":0},{"$f":"IFERROR(AVERAGEIF('Assessment form'!$C$8:$C$89,'Data summary'!$B26,'Assessment form'!$I$8:$I$89),\"\")","v":""}]
[null,"Solutions correcting water, electrolytes and acid-based disturbances",{"$f":"COUNTIFS('Assessment form'!$C$8:$C$88,'Data summary'!$B27,'Assessment form'!$I$8:$I$88,\">0\")","v":0},{"$f":"COUNTIFS('Assessment form'!$C$8:$C$88,'Data summary'!$B27,'Assessment form'!$I$8:$I$88,\">0\")/COUNTIF('Assessment form'!$C$8:$C$88,'Data summary'!$B27)","v":0},{"$f":"IFERROR(AVERAGEIF('Assessment form'!$C$8:$C$89,'Data summary'!$B27,'Assessment form'!$I$8:$I$89),\"\")","v":""}]
[null,"Vitamins",{"$f":"COUNTIFS('Assessment form'!$C$8:$C$88,'Data summary'!$B28,'Assessment form'!$I$8:$I$88,\">0\")","v":0},{"$f":"COUNTIFS('Assessment form'!$C$8:$C$88,'Data summary'!$B28,'Assessment form'!$I$8:$I$88,\">0\")/COUNTIF('Assessment form'!$C$8:$C$88,'Data summary'!$B28)","v":0},{"$f":"IFERROR(AVERAGEIF('Assessment form'!$C$8:$C$89,'Data summary'!$B28,'Assessment form'!$I$8:$I$89),\"\")","v":""}]
[null,"Medicines to treat diabetes and endocrine conditions",{"$f":"COUNTIFS('Assessment form'!$C$8:$C$88,'Data summary'!$B29,'Assessment form'!$I$8:$I$88,\">0\")","v":0},{"$f":"COUNTIFS('Assessment form'!$C$8:$C$88,'Data summary'!$B29,'Assessment form'!$I$8:$I$88,\">0\")/COUNTIF('Assessment form'!$C$8:$C$88,'Data summary'!$B29)","v":0},{"$f":"IFERROR(AVERAGEIF('Assessment form'!$C$8:$C$89,'Data summary'!$B29,'Assessment form'!$I$8:$I$89),\"\")","v":""}]
[]
{"$rows_left_out":6}